BDBM50156199 CHEMBL3779904
SMILES COc1ccc2cccc(CCNS(=O)(=O)c3ccc(OC)c(c3)N3CCN(C)CC3)c2c1
InChI Key InChIKey=PRFXDHWSXMLZQY-UHFFFAOYSA-N
Data  1 IC50
  Tab Delimited (TSV)   2D SDfile   Computed 3D by Vconf -m prep SDfile
Find this compound or compounds like it in BindingDB:
Activity Spreadsheet -- Enzyme Inhibition Constant Data from BindingDB
Found 1 hit for monomerid = 50156199
Target5-hydroxytryptamine receptor 6(Homo sapiens (Human))
Temple University
Curated by ChEMBL
LigandPNGBDBM50156199(CHEMBL3779904)
Affinity DataIC50:  0.5nM. Assay description: Displacement of [3H]LSD from human 5-HT6 receptor expressed in CHO cell membranes after 120 mins by liquid scintillation counting method
In DepthDetails ArticlePubMed