BDBM50158048 1-(2-Chloro-benzenesulfonyl)-3-(1-methyl-1,2,3,6-tetrahydro-pyridin-4-yl)-1H-indole::CHEMBL180221
SMILES CN1CCC(=CC1)c1cn(c2ccccc12)S(=O)(=O)c1ccccc1Cl
InChI Key InChIKey=KNVNOBDURNSPNJ-UHFFFAOYSA-N
Data  1 KI  1 IC50
  Tab Delimited (TSV)   2D SDfile   Computed 3D by Vconf -m prep SDfile
Find this compound or compounds like it in BindingDB:
Activity Spreadsheet -- Enzyme Inhibition Constant Data from BindingDB
Found 2 hits for monomerid = 50158048
Target5-hydroxytryptamine receptor 6(Homo sapiens (Human))
Wyeth Research
Curated by ChEMBL
LigandPNGBDBM50158048(1-(2-Chloro-benzenesulfonyl)-3-(1-methyl-1,2,3,6-t...)
Affinity DataKi:  10nM. Assay description: Binding affinity against cloned human 5-hydroxytryptamine 6 receptor expressed in HeLa cells using [3H]-LSD
In DepthDetails ArticlePubMed
Target5-hydroxytryptamine receptor 6(Homo sapiens (Human))
Wyeth Research
Curated by ChEMBL
LigandPNGBDBM50158048(1-(2-Chloro-benzenesulfonyl)-3-(1-methyl-1,2,3,6-t...)
Affinity DataIC50:  0.700nM. Assay description: Inhibitory concentration against 5-HT stimulated cAMP production in HeLa cells stably transfected with human 5-HT6 receptor
In DepthDetails ArticlePubMed