BDBM50160018 CHEMBL3785155::US10093640, Example 226::US10844032, Example 226
SMILES Cc1cc(OCCCc2c([nH]c3cc(Cl)ccc23)C(=O)NS(=O)(=O)CCNC(=O)C2CCCCC2)cc(C)c1Cl
InChI Key InChIKey=NEPGYBYFRTXHOG-UHFFFAOYSA-N
Data  2 KI  1 IC50
  Tab Delimited (TSV)   2D SDfile   Computed 3D by Vconf -m prep SDfile
Find this compound or compounds like it in BindingDB:
Activity Spreadsheet -- Enzyme Inhibition Constant Data from BindingDB
Found 3 hits for monomerid = 50160018
TargetInduced myeloid leukemia cell differentiation protein Mcl-1(Homo sapiens (Human))
Vanderbilt University School Of Medicine
Curated by ChEMBL
LigandPNGBDBM50160018(CHEMBL3785155 | US10093640, Example 226 | US108440...)
Affinity DataKi:  55nM. Assay description: Displacement of FITC-Bak-BH3 peptide probe from N-terminal His-tagged human Mcl-1 (172 to 327 residues) expressed in Escherichia coli BL21(DE3) after...
In DepthDetails ArticlePubMed
TargetInduced myeloid leukemia cell differentiation protein Mcl-1 [172-327](Homo sapiens (Human))
Vanderbilt University
US Patent
LigandPNGBDBM50160018(CHEMBL3785155 | US10093640, Example 226 | US108440...)
Affinity DataKi: <100nM. Assay description: The assay was run using a fluorescein isothiocyanate-labeled BH3 peptide derived from Bak (FITC-AHx-GQVGRQLAIIGDDINR-NH2) that was purchased from Gen...
In DepthDetails US Patent
TargetInduced myeloid leukemia cell differentiation protein Mcl-1(Homo sapiens (Human))
Vanderbilt University School Of Medicine
Curated by ChEMBL
LigandPNGBDBM50160018(CHEMBL3785155 | US10093640, Example 226 | US108440...)
Affinity DataIC50: <100nMpH: 7.5 T: 2°C. Assay description: Compound affinity was measured using a fluorescence polarization anisotropy competition assay. Anisotropy measurements were carried out in 384-well, ...
In DepthDetails US Patent