BDBM50161067 (2R)-2-[3-ISOBUTYL-2,5-DIOXO-4-(QUINOLIN-3-YLMETHYL)-1,4-DIAZEPAN-1-YL]-N-METHYL-3-(2-NAPHTHYL)PROPANAMIDE::(S)-2-((S)-3-Isobutyl-2,5-dioxo-4-quinolin-3-ylmethyl-[1,4]diazepan-1-yl)-N-methyl-3-naphthalen-2-yl-propionamide::CHEMBL446435
SMILES CNC(=O)[C@H](Cc1ccc2ccccc2c1)N1CCC(=O)N(Cc2cnc3ccccc3c2)[C@@H](CC(C)C)C1=O
InChI Key InChIKey=COVPLULNDBDXTN-KYJUHHDHSA-N
Data  1 IC50
PDB links: 1 PDB ID matches this monomer.
  Tab Delimited (TSV)   2D SDfile   Computed 3D by Vconf -m prep SDfile
Find this compound or compounds like it in BindingDB:
Activity Spreadsheet -- Enzyme Inhibition Constant Data from BindingDB
Found 1 hit for monomerid = 50161067
TargetIntegrin alpha-L/Intercellular adhesion molecule 1(Homo sapiens (Human))
Novartis Institutes For Biomedical Research
Curated by ChEMBL
LigandPNGBDBM50161067((2R)-2-[3-ISOBUTYL-2,5-DIOXO-4-(QUINOLIN-3-YLMETHY...)
Affinity DataIC50:  69nM. Assay description: In vitro inhibitory concentrationfor Lymphocyte function associated antigen 1/Intercellular adhesion molecule 1 (LFA-1/ICAM-1)