BDBM50161341 4-(5-Bromo-furan-2-yl)-8-isopropyl-5H-indeno[1,2-d]pyrimidin-2-ylamine::4-(5-bromofuran-2-yl)-8-isopropyl-5H-indeno[1,2-d]pyrimidin-2-amine::CHEMBL360241
SMILES CC(C)c1ccc2Cc3c(nc(N)nc3-c3ccc(Br)o3)-c2c1
InChI Key InChIKey=JVGSJLSEXDJERU-UHFFFAOYSA-N
Data  1 KI
  Tab Delimited (TSV)   2D SDfile   Computed 3D by Vconf -m prep SDfile
Find this compound or compounds like it in BindingDB:
Activity Spreadsheet -- Enzyme Inhibition Constant Data from BindingDB
Found 1 hit for monomerid = 50161341
TargetAdenosine receptor A2a(Homo sapiens (Human))
Leiden/Amsterdam Center For Drug Research
Curated by ChEMBL
LigandPNGBDBM50161341(4-(5-Bromo-furan-2-yl)-8-isopropyl-5H-indeno[1,2-d...)
Affinity DataKi:  0.800nM. Assay description: Binding affinity to human adenosine A2A receptor
In DepthDetails ArticlePubMed