BDBM50164199 3,9-difluoro-12-(5-fluoro-3,4,5-trihydroxy-6-hydroxymethyltetrahydro-2H-2-pyranyl)-6,7,12,13-tetrahydro-5H-indolo[2,3-a]pyrrolo[3,4-c]carbazole-5,7-dione::CHEMBL189270
SMILES OCC1OC(C(O)C(O)C1(F)F)n1c2ccc(F)cc2c2c3C(=O)NC(=O)c3c3c4cc(F)ccc4[nH]c3c12
InChI Key InChIKey=BFHMVGJYMICIPN-UHFFFAOYSA-N
Data  1 EC50
  Tab Delimited (TSV)   2D SDfile   Computed 3D by Vconf -m prep SDfile
Find this compound or compounds like it in BindingDB:
Activity Spreadsheet -- Enzyme Inhibition Constant Data from BindingDB
Found 1 hit for monomerid = 50164199
TargetDNA topoisomerase 1(Homo sapiens (Human))
The Bristol-Myers Squibb Pharmaceutical Research Institute
Curated by ChEMBL
LigandPNGBDBM50164199(3,9-difluoro-12-(5-fluoro-3,4,5-trihydroxy-6-hydro...)
Affinity DataEC50:  12.8nM. Assay description: Topoisomerase I activity for single-strand breaks in the DNA substrate
In DepthDetails ArticlePubMed