BDBM50165939 AEKKDEGPYRMEHFRWGSPPKD::CHEMBL412536
SMILES CSCC[C@H](NC(=O)[C@H](CCCNC(N)=N)NC(=O)[C@H](Cc1ccc(O)cc1)NC(=O)[C@@H]1CCCN1C(=O)CNC(=O)[C@H](CCC(O)=O)NC(=O)[C@H](CC(O)=O)NC(=O)[C@H](CCCCN)NC(=O)[C@H](CCCCN)NC(=O)[C@H](CCC(O)=O)NC(=O)[C@H](C)N)C(=O)N[C@@H](CCC(O)=O)C(=O)N[C@@H](Cc1cnc[nH]1)C(=O)N[C@@H](Cc1ccccc1)C(=O)N[C@@H](CCCNC(N)=N)C(=O)N[C@@H](Cc1c[nH]c2ccccc12)C(=O)NCC(=O)N[C@@H](CO)C(=O)N1CCC[C@H]1C(=O)N1CCC[C@H]1C(=O)N[C@@H](CCCCN)C(=O)N[C@@H](CC(O)=O)C(O)=O
InChI Key InChIKey=XLLJFSCSXTYVTN-UPWOUFKKSA-N
Data  4 KI  2 EC50
  Tab Delimited (TSV)   2D SDfile   Computed 3D by Vconf -m prep SDfile
Find this compound or compounds like it in BindingDB:
Activity Spreadsheet -- Enzyme Inhibition Constant Data from BindingDB
Found 6 hits for monomerid = 50165939
TargetMelanocyte-stimulating hormone receptor(Homo sapiens (Human))
Eli Lilly
Curated by ChEMBL
LigandPNGBDBM50165939(AEKKDEGPYRMEHFRWGSPPKD | CHEMBL412536)
Affinity DataKi:  0.890nM. Assay description: Inhibition of [125I]NDP-alpha-MSH binding to melanocortin-1 receptor expressed in HEK293 cells
In DepthDetails ArticlePubMed
TargetMelanocortin receptor 4(Homo sapiens (Human))
Eli Lilly
Curated by ChEMBL
LigandPNGBDBM50165939(AEKKDEGPYRMEHFRWGSPPKD | CHEMBL412536)
Affinity DataKi:  8.20nM. Assay description: Inhibition of [125I]-NDP-alpha-MSH binding to melanocortin-4 receptor expressed in HEK293 cells
In DepthDetails ArticlePubMed
TargetMelanocortin receptor 3(Homo sapiens (Human))
Eli Lilly
Curated by ChEMBL
LigandPNGBDBM50165939(AEKKDEGPYRMEHFRWGSPPKD | CHEMBL412536)
Affinity DataKi:  11nM. Assay description: Inhibition of [125I]-NDP-alpha-MSH binding to melanocortin-3 receptor expressed in HEK293 cells
In DepthDetails ArticlePubMed
TargetMelanocortin receptor 5(Homo sapiens (Human))
Eli Lilly
Curated by ChEMBL
LigandPNGBDBM50165939(AEKKDEGPYRMEHFRWGSPPKD | CHEMBL412536)
Affinity DataKi:  77nM. Assay description: Inhibition of [125I]NDP-alpha-MSH binding to melanocortin-5 receptor expressed in HEK293 cells
In DepthDetails ArticlePubMed
TargetMelanocortin receptor 4(Homo sapiens (Human))
Eli Lilly
Curated by ChEMBL
LigandPNGBDBM50165939(AEKKDEGPYRMEHFRWGSPPKD | CHEMBL412536)
Affinity DataEC50:  0.420nM. Assay description: Agonist activity at wild type human melanocortin-4 receptor expressed in HEK293 cells co-transfected with CRE/beta-galactosidase reporter gene assess...
In DepthDetails ArticlePubMed
TargetMelanocortin receptor 4(Homo sapiens (Human))
Eli Lilly
Curated by ChEMBL
LigandPNGBDBM50165939(AEKKDEGPYRMEHFRWGSPPKD | CHEMBL412536)
Affinity DataEC50:  3.20nM. Assay description: Agonist activity at human Melanocortin-4 receptor as peptide required for 50% maximal cAMP release (n > or =2)
In DepthDetails ArticlePubMed