BDBM50166587 CHEMBL3799530
SMILES CCn1ncc2c(F)cc(cc12)C(=O)Nc1nnc(s1)C1(C)CCN(CC1)C(=O)C(C)(C)O
InChI Key InChIKey=SEEMGOZGWDILNT-UHFFFAOYSA-N
Data  1 KI
  Tab Delimited (TSV)   2D SDfile   Computed 3D by Vconf -m prep SDfile
Find this compound or compounds like it in BindingDB:
Activity Spreadsheet -- Enzyme Inhibition Constant Data from BindingDB
Found 1 hit for monomerid = 50166587
TargetProstaglandin E2 receptor EP3 subtype(Homo sapiens (Human))
Pfizer
Curated by ChEMBL
LigandPNGBDBM50166587(CHEMBL3799530)
Affinity DataKi:  10nM. Assay description: Displacement of [3H]PGE2 from human recombinant EP3 receptor expressed in human Chem1 cell membrane by scintillation proximity assay
In DepthDetails ArticlePubMed