BDBM50167074 CHEMBL3799913
SMILES Oc1cn(ccc1=O)-c1cc(ccn1)-c1ccccc1
InChI Key InChIKey=QWTHMOHMTPERDO-UHFFFAOYSA-N
Data  3 IC50
  Tab Delimited (TSV)   2D SDfile   Computed 3D by Vconf -m prep SDfile
Find this compound or compounds like it in BindingDB:
Activity Spreadsheet -- Enzyme Inhibition Constant Data from BindingDB
Found 3 hits for monomerid = 50167074
TargetCatechol O-methyltransferase(Rattus norvegicus (Rat))
Merck
Curated by ChEMBL
LigandPNGBDBM50167074(CHEMBL3799913)
Affinity DataIC50:  15nM. Assay description: Inhibition of recombinant rat C-terminal His10-tagged MB-COMT transfected in Escherichia coli BL21-CodonPlus(DE3)-RIPL using SAM/dopamine as substrat...
In DepthDetails ArticlePubMed
TargetLanosterol synthase(Rattus norvegicus)
Merck
Curated by ChEMBL
LigandPNGBDBM50167074(CHEMBL3799913)
Affinity DataIC50:  40nM. Assay description: Inhibition of recombinant human C-terminal His6-tagged MB-COMT expressed in Bacmid using SAM/dopamine as substrate preincubated for 2 hrs followed by...
In DepthDetails ArticlePubMed
TargetLanosterol synthase(Rattus norvegicus)
Merck
Curated by ChEMBL
LigandPNGBDBM50167074(CHEMBL3799913)
Affinity DataIC50:  3.02E+3nM. Assay description: Inhibition of recombinant human C-terminal His6-tagged soluble COMT transfected in Escherichia coli BL21-Gold (DE3) using SAM/dopamine as substrate p...
In DepthDetails ArticlePubMed