BDBM50170632 CHEMBL93647::N''-(4-(5-((1H-BENZIMIDAZOL-2-YLAMINO)METHYL)-2-THIENYL)-1,3-THIAZOL-2-YL)GUANIDINE::N-(4-{5-[(1H-Benzoimidazol-2-ylamino)-methyl]-thiophen-2-yl}-thiazol-2-yl)-guanidine
SMILES NC(N)=Nc1nc(cs1)-c1ccc(CNc2nc3ccccc3[nH]2)s1
InChI Key InChIKey=CKJGKHXCUDWFDC-UHFFFAOYSA-N
Data  1 IC50
PDB links: 1 PDB ID matches this monomer.
  Tab Delimited (TSV)   2D SDfile   Computed 3D by Vconf -m prep SDfile
Find this compound or compounds like it in BindingDB:
Activity Spreadsheet -- Enzyme Inhibition Constant Data from BindingDB
Found 1 hit for monomerid = 50170632
TargetAdenosine deaminase(Homo sapiens (Human))
Fujisawa Pharmaceutical
Curated by ChEMBL
LigandPNGBDBM50170632(CHEMBL93647 | N''-(4-(5-((1H-BENZIMIDAZOL-2-YLAMIN...)
Affinity DataIC50:  700nM. Assay description: Inhibitory concentration against adenosine deaminase