BDBM50170932 CHEMBL3805502
SMILES N[C@H]1C[C@H](CO[C@@H]1c1cc(F)c(F)cc1F)N1Cc2nn3ccc(nc3c2C1)C(F)(F)F
InChI Key InChIKey=ZEKKANWWDPERCI-AHRODOEDSA-N
Data  3 IC50
  Tab Delimited (TSV)   2D SDfile   Computed 3D by Vconf -m prep SDfile
Find this compound or compounds like it in BindingDB:
Activity Spreadsheet -- Enzyme Inhibition Constant Data from BindingDB
Found 3 hits for monomerid = 50170932
TargetAcyl-protein thioesterase 1(Rattus norvegicus)
Merck Research Laboratories
Curated by ChEMBL
LigandPNGBDBM50170932(CHEMBL3805502)
Affinity DataIC50:  2.30E+4nM. Assay description: Inhibition of human FAP
In DepthDetails ArticlePubMed
TargetDipeptidyl peptidase 4(Homo sapiens (Human))
Merck Research Laboratories
Curated by ChEMBL
LigandPNGBDBM50170932(CHEMBL3805502)
Affinity DataIC50:  1.5nM. Assay description: Inhibition of human DPP4
In DepthDetails ArticlePubMed
TargetDipeptidyl peptidase 8(Homo sapiens (Human))
Merck Research Laboratories
Curated by ChEMBL
LigandPNGBDBM50170932(CHEMBL3805502)
Affinity DataIC50:  1.00E+5nM. Assay description: Inhibition of DPP8 (unknown origin)
In DepthDetails ArticlePubMed