BDBM50171807 CHEMBL193851::[3,5-Dichloro-4-(4-hydroxy-phenoxy)-phenyl]-acetic acid
SMILES OC(=O)Cc1cc(Cl)c(Oc2ccc(O)cc2)c(Cl)c1
InChI Key InChIKey=RYDWJBNYCSGOFO-UHFFFAOYSA-N
Data  2 IC50
  Tab Delimited (TSV)   2D SDfile   Computed 3D by Vconf -m prep SDfile
Find this compound or compounds like it in BindingDB:
Activity Spreadsheet -- Enzyme Inhibition Constant Data from BindingDB
Found 2 hits for monomerid = 50171807
TargetThyroid hormone receptor beta(Homo sapiens (Human))
Pharmaceutical Research Institute
Curated by ChEMBL
LigandPNGBDBM50171807(CHEMBL193851 | [3,5-Dichloro-4-(4-hydroxy-phenoxy)...)
Affinity DataIC50:  2.14E+3nM. Assay description: Inhibitory concentration against cloned human thyroid hormone receptor beta 1
In DepthDetails ArticlePubMed
TargetThyroid hormone receptor alpha(Homo sapiens (Human))
Pharmaceutical Research Institute
Curated by ChEMBL
LigandPNGBDBM50171807(CHEMBL193851 | [3,5-Dichloro-4-(4-hydroxy-phenoxy)...)
Affinity DataIC50:  3.61E+3nM. Assay description: Inhibitory concentration against cloned human thyroid hormone receptor alpha 1
In DepthDetails ArticlePubMed