BDBM50174615 CHEMBL424842::{2-[2-((R)-2-Methyl-pyrrolidin-1-yl)-ethyl]-benzofuran-5-ylmethyl}-(5-nitro-thiazol-2-yl)-amine
SMILES C[C@@H]1CCCN1CCc1cc2cc(CNc3ncc(s3)[N+]([O-])=O)ccc2o1
InChI Key InChIKey=FMVGVBQNUFKJOR-CYBMUJFWSA-N
Data  2 KI
  Tab Delimited (TSV)   2D SDfile   Computed 3D by Vconf -m prep SDfile
Find this compound or compounds like it in BindingDB:
Activity Spreadsheet -- Enzyme Inhibition Constant Data from BindingDB
Found 2 hits for monomerid = 50174615
TargetHistamine H3 receptor(Homo sapiens (Human))
Abbott Laboratories
Curated by ChEMBL
LigandPNGBDBM50174615(CHEMBL424842 | {2-[2-((R)-2-Methyl-pyrrolidin-1-yl...)
Affinity DataKi:  0.190nM. Assay description: In vitro binding affinity for human histamine H3 receptor using [3H]-N-alpha-methylhistamine
In DepthDetails ArticlePubMed
TargetHistamine H3 receptor(Rattus norvegicus (rat))
Abbott Laboratories
Curated by ChEMBL
LigandPNGBDBM50174615(CHEMBL424842 | {2-[2-((R)-2-Methyl-pyrrolidin-1-yl...)
Affinity DataKi:  0.680nM. Assay description: In vitro binding affinity for rat histamine H3 receptor using [3H]-N-alpha-methylhistamine
In DepthDetails ArticlePubMed