BDBM50175715 3-(methylsulfonamido)-3-oxopropylphosphonic acid::CHEMBL202288
SMILES CS(=O)(=O)NC(=O)CCP(O)(O)=O
InChI Key InChIKey=ZACJMUYEHDWDFA-UHFFFAOYSA-N
Data  2 KI
  Tab Delimited (TSV)   2D SDfile   Computed 3D by Vconf -m prep SDfile
Find this compound or compounds like it in BindingDB:
Activity Spreadsheet -- Enzyme Inhibition Constant Data from BindingDB
Found 2 hits for monomerid = 50175715
TargetFructose-bisphosphate aldolase class 2(Escherichia coli (strain K12))
Université
Curated by ChEMBL
LigandPNGBDBM50175715(3-(methylsulfonamido)-3-oxopropylphosphonic acid |...)
Affinity DataKi: >1.00E+7nM. Assay description: Inhibitory activity against class II FBP aldolase from Escherichia coli
In DepthDetails ArticlePubMed
TargetFructose-bisphosphate aldolase A(Oryctolagus cuniculus)
Université
Curated by ChEMBL
LigandPNGBDBM50175715(3-(methylsulfonamido)-3-oxopropylphosphonic acid |...)
Affinity DataKi: >1.00E+7nM. Assay description: Inhibitory activity against class I FBP aldolase from rabbit
In DepthDetails ArticlePubMed