BDBM50176860 CHEMBL3809059
SMILES COc1ccc(cc1)N1N=C(\C(=C\c2ccc(o2)-c2ccccc2C(O)=O)C1=O)c1ccccc1
InChI Key InChIKey=SKEVDQNJWPPYIJ-ULJHMMPZSA-N
Data  1 IC50
  Tab Delimited (TSV)   2D SDfile   Computed 3D by Vconf -m prep SDfile
Find this compound or compounds like it in BindingDB:
Activity Spreadsheet -- Enzyme Inhibition Constant Data from BindingDB
Found 1 hit for monomerid = 50176860
TargetReplicase polyprotein 1ab(Human SARS coronavirus (SARS-CoV) (Severe acute re...)
Academia Sinica
Curated by ChEMBL
LigandPNGBDBM50176860(CHEMBL3809059)
Affinity DataIC50:  3.07E+4nM. Assay description: Inhibition of SARS coronavirus recombinant 3CL-PRO expressed in Escherichia coli JM109 cells using Dabcyl-KTSAVLQSGFRKME-Edans as fluorogenic substra...
In DepthDetails ArticlePubMed