BDBM50177495 CHEMBL381715::{(S)-1-[(2,3-dihydro-indole-1-carbonyl)-hydrazonomethyl]-pentyl}-carbamic acid tert-butyl ester
SMILES CCCC[C@H](NC(=O)OC(C)(C)C)C=NN=C(O)N1CCc2ccccc12
InChI Key InChIKey=XFJFXJUUFGRLHF-INIZCTEOSA-N
Data  4 IC50
  Tab Delimited (TSV)   2D SDfile   Computed 3D by Vconf -m prep SDfile
Find this compound or compounds like it in BindingDB:
Activity Spreadsheet -- Enzyme Inhibition Constant Data from BindingDB
Found 4 hits for monomerid = 50177495
TargetPro-cathepsin H(Homo sapiens (Human))
Glaxosmithkline
Curated by ChEMBL
LigandPNGBDBM50177495(CHEMBL381715 | {(S)-1-[(2,3-dihydro-indole-1-carbo...)
Affinity DataIC50: >1.30E+4nM. Assay description: Inhibition of recombinant human cathepsin H in a fluorescence assay
In DepthDetails ArticlePubMed
TargetCathepsin B(Homo sapiens (Human))
Glaxosmithkline
Curated by ChEMBL
LigandPNGBDBM50177495(CHEMBL381715 | {(S)-1-[(2,3-dihydro-indole-1-carbo...)
Affinity DataIC50:  3.50E+4nM. Assay description: Inhibition of recombinant human cathepsin B in a fluorescence assay
In DepthDetails ArticlePubMed
TargetCathepsin K(Homo sapiens (Human))
Glaxosmithkline
Curated by ChEMBL
LigandPNGBDBM50177495(CHEMBL381715 | {(S)-1-[(2,3-dihydro-indole-1-carbo...)
Affinity DataIC50:  48nM. Assay description: Inhibition of recombinant human cathepsin K in a fluorescence assay
In DepthDetails ArticlePubMed
TargetProcathepsin L(Homo sapiens (Human))
Glaxosmithkline
Curated by ChEMBL
LigandPNGBDBM50177495(CHEMBL381715 | {(S)-1-[(2,3-dihydro-indole-1-carbo...)
Affinity DataIC50:  1.40E+4nM. Assay description: Inhibition of recombinant human cathepsin L in a fluorescence assay
In DepthDetails ArticlePubMed