BDBM50178336 (3S,10S,13S,17S)-10-allyl-13-methyl-2,3,4,7,8,9,10,11,12,13,14,15,16,17-tetradecahydro-1H-cyclopenta[a]phenanthrene-3,17-diol::CHEMBL369979
SMILES C[C@]12CCC3C(CC=C4C[C@@H](O)CC[C@]34CC=C)C1CC[C@@H]2O
InChI Key InChIKey=SKEXCOMDSMNEFW-XZXJUTCTSA-N
Data  3 IC50  2 EC50
  Tab Delimited (TSV)   2D SDfile   Computed 3D by Vconf -m prep SDfile
Find this compound or compounds like it in BindingDB:
Activity Spreadsheet -- Enzyme Inhibition Constant Data from BindingDB
Found 5 hits for monomerid = 50178336
TargetAndrogen receptor(Homo sapiens (Human))
Merck Research Laboratories
Curated by ChEMBL
LigandPNGBDBM50178336((3S,10S,13S,17S)-10-allyl-13-methyl-2,3,4,7,8,9,10...)
Affinity DataIC50:  1.77E+3nM. Assay description: Inhibitory activity against AR
In DepthDetails ArticlePubMed
TargetEstrogen receptor(Homo sapiens (Human))
Merck Research Laboratories
Curated by ChEMBL
LigandPNGBDBM50178336((3S,10S,13S,17S)-10-allyl-13-methyl-2,3,4,7,8,9,10...)
Affinity DataIC50:  1.74E+3nM. Assay description: Binding affinity to human ERalpha
In DepthDetails ArticlePubMed
TargetEstrogen receptor beta(Homo sapiens (Human))
Merck Research Laboratories
Curated by ChEMBL
LigandPNGBDBM50178336((3S,10S,13S,17S)-10-allyl-13-methyl-2,3,4,7,8,9,10...)
Affinity DataIC50:  128nM. Assay description: Binding affinity to human ERbeta
In DepthDetails ArticlePubMed
TargetEstrogen receptor beta(Homo sapiens (Human))
Merck Research Laboratories
Curated by ChEMBL
LigandPNGBDBM50178336((3S,10S,13S,17S)-10-allyl-13-methyl-2,3,4,7,8,9,10...)
Affinity DataEC50:  148nM. Assay description: Effect on transactivation of ALP gene expression in HEK293 cells transfected with hERbeta
In DepthDetails ArticlePubMed
TargetEstrogen receptor(Homo sapiens (Human))
Merck Research Laboratories
Curated by ChEMBL
LigandPNGBDBM50178336((3S,10S,13S,17S)-10-allyl-13-methyl-2,3,4,7,8,9,10...)
Affinity DataEC50:  1.00E+3nM. Assay description: Effect on transactivation of ALP gene expression in HEK293 cells transfected with hERalpha
In DepthDetails ArticlePubMed