BDBM50182029 CHEMBL3818168
SMILES Nc1nc2[nH]c(SCCC3OCCCO3)nc2c(=O)[nH]1
InChI Key InChIKey=JJESTICLSKCAAZ-UHFFFAOYSA-N
Data  2 Kd
  Tab Delimited (TSV)   2D SDfile   Computed 3D by Vconf -m prep SDfile
Find this compound or compounds like it in BindingDB:
Activity Spreadsheet -- Enzyme Inhibition Constant Data from BindingDB
Found 2 hits for monomerid = 50182029
Target2-amino-4-hydroxy-6-hydroxymethyldihydropteridine diphosphokinase(Staphylococcus aureus)
Monash University
Curated by ChEMBL
LigandPNGBDBM50182029(CHEMBL3818168)
Affinity DataKd:  7.90E+3nM. Assay description: Binding affinity to biotinylated Staphylococcus aureus HPPK in presence of 1 mM ATP by SPR assay
In DepthDetails ArticlePubMed
Target2-amino-4-hydroxy-6-hydroxymethyldihydropteridine pyrophosphokinase(Escherichia coli (strain K12))
Monash University
Curated by ChEMBL
LigandPNGBDBM50182029(CHEMBL3818168)
Affinity DataKd:  2.33E+4nM. Assay description: Binding affinity to biotinylated Escherichia coli HPPK expressed in Escherichia coli BL21 (DE3) in presence of 1 mM ATP by SPR assay
In DepthDetails ArticlePubMed