BDBM50184628 2-hydroxy-4-oxo-6-phenylhex-2-enoic acid::CHEMBL210996
SMILES OC(=O)C(=O)CC(=O)CCc1ccccc1
InChI Key InChIKey=IIISQTZDBAGFRK-UHFFFAOYSA-N
Data  1 IC50
  Tab Delimited (TSV)   2D SDfile   Computed 3D by Vconf -m prep SDfile
Find this compound or compounds like it in BindingDB:
Activity Spreadsheet -- Enzyme Inhibition Constant Data from BindingDB
Found 1 hit for monomerid = 50184628
TargetIntegrase(Human immunodeficiency virus 1)
Bristol-Myers Squibb
Curated by ChEMBL
LigandPNGBDBM50184628(2-hydroxy-4-oxo-6-phenylhex-2-enoic acid | CHEMBL2...)
Affinity DataIC50:  3.00E+4nM. Assay description: Inhibition of HIV1 recombinant integrase
In DepthDetails ArticlePubMed