BDBM50187216 CHEMBL3827575
SMILES [Br-].[Br-].NC(=O)c1cc[n+](CC[n+]2cccc(NC(=O)\C=N/O)c2)cc1
InChI Key InChIKey=YPEDBQZMKBFVHS-UHFFFAOYSA-N
Data  1 IC50  2 Kd
  Tab Delimited (TSV)   2D SDfile   Computed 3D by Vconf -m prep SDfile
Find this compound or compounds like it in BindingDB:
Activity Spreadsheet -- Enzyme Inhibition Constant Data from BindingDB
Found 3 hits for monomerid = 50187216
TargetAcetylcholinesterase(Homo sapiens (Human))
Defence Research & Development Establishment
Curated by ChEMBL
LigandPNGBDBM50187216(CHEMBL3827575)
Affinity DataKd:  1.67E+5nM. Assay description: Binding affinity to VX-inhibited hemoglobin free erythrocyte ghost human AChE using acetylcholine iodide as substrate measured for 1 hr by spectropho...
In DepthDetails ArticlePubMed
TargetAcetylcholinesterase(Homo sapiens (Human))
Defence Research & Development Establishment
Curated by ChEMBL
LigandPNGBDBM50187216(CHEMBL3827575)
Affinity DataIC50:  1.87E+6nM. Assay description: Inhibition of hemoglobin free erythrocyte ghost human AChE using acetylcholine iodide as substrate measured for 1 hr by spectrophotometry based Ellma...
In DepthDetails ArticlePubMed
TargetAcetylcholinesterase(Homo sapiens (Human))
Defence Research & Development Establishment
Curated by ChEMBL
LigandPNGBDBM50187216(CHEMBL3827575)
Affinity DataKd:  2.31E+3nM. Assay description: Binding affinity to sarin-inhibited hemoglobin free erythrocyte ghost human AChE using acetylcholine iodide as substrate measured for 1 hr by spectro...
In DepthDetails ArticlePubMed