BDBM50187217 2,4-dichloro-6-{[(2S)-2-(2H-tetrazol-5-yl)pyrrolidin-1-yl]sulfonyl}phenol::CHEMBL378114
SMILES Oc1c(Cl)cc(Cl)cc1S(=O)(=O)N1CCC[C@H]1c1nnn[nH]1
InChI Key InChIKey=PVAMJWSWTDXDMD-QMMMGPOBSA-N
Data  1 IC50
  Tab Delimited (TSV)   2D SDfile   Computed 3D by Vconf -m prep SDfile
Find this compound or compounds like it in BindingDB:
Activity Spreadsheet -- Enzyme Inhibition Constant Data from BindingDB
Found 1 hit for monomerid = 50187217
TargetRNA-directed RNA polymerase(Hepatitis C virus)
Wyeth Research
Curated by ChEMBL
LigandPNGBDBM50187217(2,4-dichloro-6-{[(2S)-2-(2H-tetrazol-5-yl)pyrrolid...)
Affinity DataIC50:  560nM. Assay description: Inhibition of HCV NS5B RNA dependent RNA polymerase
In DepthDetails ArticlePubMed