BDBM50192936 4-(3-cyclohexylureido)butanoic acid::4-{[(CYCLOHEXYLAMINO)CARBONYL]AMINO}BUTANOIC ACID::CHEMBL219695
SMILES OC(=O)CCCNC(=O)NC1CCCCC1
InChI Key InChIKey=WSVFRGGLURJIMG-UHFFFAOYSA-N
Data  2 IC50
PDB links: 1 PDB ID matches this monomer.
  Tab Delimited (TSV)   2D SDfile   Computed 3D by Vconf -m prep SDfile
Find this compound or compounds like it in BindingDB:
Activity Spreadsheet -- Enzyme Inhibition Constant Data from BindingDB
Found 2 hits for monomerid = 50192936
TargetBifunctional epoxide hydrolase 2(Mus musculus (Mouse))
University Of California
Curated by ChEMBL
LigandPNGBDBM50192936(4-(3-cyclohexylureido)butanoic acid | 4-{[(CYCLOHE...)
Affinity DataIC50:  1.90E+3nM. Assay description: Inhibition of mouse recombinant soluble Epoxide hydrolase
In DepthDetails ArticlePubMed
TargetBifunctional epoxide hydrolase 2(Homo sapiens (Human))
University Of California
Curated by ChEMBL
LigandPNGBDBM50192936(4-(3-cyclohexylureido)butanoic acid | 4-{[(CYCLOHE...)
Affinity DataIC50:  3.60E+4nM. Assay description: Inhibition of human recombinant soluble Epoxide hydrolase