BDBM50195484 1-((2R,6R)-1-(4-amino-3,5-dichlorobenzoyl)-2,6-dimethylpiperidin-4-yl)imidazolidin-2-one::CHEMBL374283
SMILES C[C@@H]1CC(C[C@@H](C)N1C(=O)c1cc(Cl)c(N)c(Cl)c1)N1CCNC1=O
InChI Key InChIKey=NRUOIYWARKEXLI-NXEZZACHSA-N
Data  2 KI  3 IC50
  Tab Delimited (TSV)   2D SDfile   Computed 3D by Vconf -m prep SDfile
Find this compound or compounds like it in BindingDB:
Activity Spreadsheet -- Enzyme Inhibition Constant Data from BindingDB
Found 5 hits for monomerid = 50195484
Target11-beta-hydroxysteroid dehydrogenase 1(Homo sapiens (Human))
Abbott Laboratories
Curated by ChEMBL
LigandPNGBDBM50195484(1-((2R,6R)-1-(4-amino-3,5-dichlorobenzoyl)-2,6-dim...)
Affinity DataKi:  22nM. Assay description: Inhibition of human 11beta-HSD1 expressed in Escherichia coli by SPA
In DepthDetails ArticlePubMed
Target11-beta-hydroxysteroid dehydrogenase 1(Rattus norvegicus (rat))
Abbott Laboratories
Curated by ChEMBL
LigandPNGBDBM50195484(1-((2R,6R)-1-(4-amino-3,5-dichlorobenzoyl)-2,6-dim...)
Affinity DataKi:  39nM. Assay description: Inhibition of rat 11beta-HSD1
In DepthDetails ArticlePubMed
Target11-beta-hydroxysteroid dehydrogenase 1(Homo sapiens (Human))
Abbott Laboratories
Curated by ChEMBL
LigandPNGBDBM50195484(1-((2R,6R)-1-(4-amino-3,5-dichlorobenzoyl)-2,6-dim...)
Affinity DataIC50:  76nM. Assay description: Inhibition of human 11beta-HSD1 expressed in HEK293 cells by fluorescence polarization immuno-assay
In DepthDetails ArticlePubMed
Target11-beta-hydroxysteroid dehydrogenase type 2(Homo sapiens (Human))
Abbott Laboratories
Curated by ChEMBL
LigandPNGBDBM50195484(1-((2R,6R)-1-(4-amino-3,5-dichlorobenzoyl)-2,6-dim...)
Affinity DataIC50: >1.00E+4nM. Assay description: Inhibition of human 11beta-HSD2 by SPA
In DepthDetails ArticlePubMed
Target11-beta-hydroxysteroid dehydrogenase type 2(Rattus norvegicus)
Abbott Laboratories
Curated by ChEMBL
LigandPNGBDBM50195484(1-((2R,6R)-1-(4-amino-3,5-dichlorobenzoyl)-2,6-dim...)
Affinity DataIC50: >1.00E+4nM. Assay description: Inhibition of rat 11beta-HSD2
In DepthDetails ArticlePubMed