BDBM50195493 4-amino-3,5-dichloro-N-cyclopropyl-N-((1s,4s)-4-(1-methylpiperazine-4-carbonyl)cyclohexyl)benzamide::CHEMBL219784
SMILES CN1CCN(CC1)C(=O)[C@@H]1CC[C@@H](CC1)N(C1CC1)C(=O)c1cc(Cl)c(N)c(Cl)c1
InChI Key InChIKey=DFNPIZUBHLSPSK-FZNQNYSPSA-N
Data  2 KI  3 IC50
  Tab Delimited (TSV)   2D SDfile   Computed 3D by Vconf -m prep SDfile
Find this compound or compounds like it in BindingDB:
Activity Spreadsheet -- Enzyme Inhibition Constant Data from BindingDB
Found 5 hits for monomerid = 50195493
Target11-beta-hydroxysteroid dehydrogenase 1(Rattus norvegicus (rat))
Abbott Laboratories
Curated by ChEMBL
LigandPNGBDBM50195493(4-amino-3,5-dichloro-N-cyclopropyl-N-((1s,4s)-4-(1...)
Affinity DataKi:  9nM. Assay description: Inhibition of rat 11beta-HSD1
In DepthDetails ArticlePubMed
Target11-beta-hydroxysteroid dehydrogenase 1(Homo sapiens (Human))
Abbott Laboratories
Curated by ChEMBL
LigandPNGBDBM50195493(4-amino-3,5-dichloro-N-cyclopropyl-N-((1s,4s)-4-(1...)
Affinity DataKi:  560nM. Assay description: Inhibition of human 11beta-HSD1 expressed in Escherichia coli by SPA
In DepthDetails ArticlePubMed
Target11-beta-hydroxysteroid dehydrogenase type 2(Homo sapiens (Human))
Abbott Laboratories
Curated by ChEMBL
LigandPNGBDBM50195493(4-amino-3,5-dichloro-N-cyclopropyl-N-((1s,4s)-4-(1...)
Affinity DataIC50: >1.00E+4nM. Assay description: Inhibition of human 11beta-HSD2 by SPA
In DepthDetails ArticlePubMed
Target11-beta-hydroxysteroid dehydrogenase type 2(Rattus norvegicus)
Abbott Laboratories
Curated by ChEMBL
LigandPNGBDBM50195493(4-amino-3,5-dichloro-N-cyclopropyl-N-((1s,4s)-4-(1...)
Affinity DataIC50: >1.00E+4nM. Assay description: Inhibition of rat 11beta-HSD2
In DepthDetails ArticlePubMed
Target11-beta-hydroxysteroid dehydrogenase 1(Homo sapiens (Human))
Abbott Laboratories
Curated by ChEMBL
LigandPNGBDBM50195493(4-amino-3,5-dichloro-N-cyclopropyl-N-((1s,4s)-4-(1...)
Affinity DataIC50: >3.00E+4nM. Assay description: Inhibition of human 11beta-HSD1 expressed in HEK293 cells by fluorescence polarization immuno-assay
In DepthDetails ArticlePubMed