BDBM50195792 CHEMBL3896367
SMILES OC(=O)c1cccc(c1)-c1cccnc1
InChI Key InChIKey=PXASTGBSGPFLFJ-UHFFFAOYSA-N
Data  2 IC50  1 Kd
PDB links: 2 PDB IDs match this monomer.
  Tab Delimited (TSV)   2D SDfile   Computed 3D by Vconf -m prep SDfile
Find this compound or compounds like it in BindingDB:
Activity Spreadsheet -- Enzyme Inhibition Constant Data from BindingDB
Found 3 hits for monomerid = 50195792
TargetBeta-lactamase(Klebsiella pneumoniae)
Uit The Arctic University Of Norway
Curated by ChEMBL
LigandPNGBDBM50195792(CHEMBL3896367)
Affinity DataKd:  2.80E+5nM. Assay description: Binding affinity to native signal deficient and TEV cleavage site containing His-tagged Klebsiella pneumoniae OXA-48 expressed in Escherichia coli as...
TargetKynurenine 3-monooxygenase(Homo sapiens (Human))
Dr. Hari Singh Gour University
Curated by ChEMBL
LigandPNGBDBM50195792(CHEMBL3896367)
Affinity DataIC50:  990nM. Assay description: Inhibition of human KMO
In DepthDetails ArticlePubMed
TargetBeta-lactamase(Klebsiella pneumoniae)
Uit The Arctic University Of Norway
Curated by ChEMBL
LigandPNGBDBM50195792(CHEMBL3896367)
Affinity DataIC50:  2.40E+5nM. Assay description: Inhibition of native signal containing Klebsiella pneumoniae OXA-48 using nitrocefin substrate pre-incubated for 5 mins before substrate addition