BDBM50197495 2-(4-benzyl-piperidine-1-carbonyl)-4-methyl-pentanoic acid hydroxyamide::2-(4-benzylpiperidine-1-carbonyl)-N-hydroxy-4-methylpentanamide::CHEMBL220941
SMILES CC(C)CC(C(=O)NO)C(=O)N1CCC(Cc2ccccc2)CC1
InChI Key InChIKey=LOEZGUJVZCKNSF-UHFFFAOYSA-N
Data  2 IC50
  Tab Delimited (TSV)   2D SDfile   Computed 3D by Vconf -m prep SDfile
Find this compound or compounds like it in BindingDB:
Activity Spreadsheet -- Enzyme Inhibition Constant Data from BindingDB
Found 2 hits for monomerid = 50197495
TargetM1 family aminopeptidase(Plasmodium falciparum (isolate FcB1 / Columbia))
University Of Lille
Curated by ChEMBL
LigandPNGBDBM50197495(2-(4-benzyl-piperidine-1-carbonyl)-4-methyl-pentan...)
Affinity DataIC50:  406nM. Assay description: Inhibition of Plasmodium falciparum FcB1 M1 aminopeptidase
In DepthDetails ArticlePubMed
TargetAminopeptidase N(Sus scrofa (Pig))
University Of Lille 2
Curated by ChEMBL
LigandPNGBDBM50197495(2-(4-benzyl-piperidine-1-carbonyl)-4-methyl-pentan...)
Affinity DataIC50:  452nM. Assay description: Inhibition of microsomal neural aminopeptidase in pig kidney
In DepthDetails ArticlePubMed