BDBM50197497 2-benzyl-N-hydroxy-N'-(4-phenyl-butyl)-malonamide::2-benzyl-N1-hydroxy-N3-(4-phenylbutyl)malonamide::CHEMBL220996
SMILES ONC(=O)C(Cc1ccccc1)C(=O)NCCCCc1ccccc1
InChI Key InChIKey=WBIXUIDQAJRMSZ-UHFFFAOYSA-N
Data  3 IC50
  Tab Delimited (TSV)   2D SDfile   Computed 3D by Vconf -m prep SDfile
Find this compound or compounds like it in BindingDB:
Activity Spreadsheet -- Enzyme Inhibition Constant Data from BindingDB
Found 3 hits for monomerid = 50197497
TargetAminopeptidase N(Sus scrofa (Pig))
University Of Lille 2
Curated by ChEMBL
LigandPNGBDBM50197497(2-benzyl-N-hydroxy-N'-(4-phenyl-butyl)-malonamide ...)
Affinity DataIC50: >1.00E+4nM. Assay description: Inhibition of microsomal neural aminopeptidase in pig kidney
In DepthDetails ArticlePubMed
TargetM1 family aminopeptidase(Plasmodium falciparum (isolate FcB1 / Columbia))
University Of Lille
Curated by ChEMBL
LigandPNGBDBM50197497(2-benzyl-N-hydroxy-N'-(4-phenyl-butyl)-malonamide ...)
Affinity DataIC50:  46nM. Assay description: Inhibition of Plasmodium falciparum FcB1 M1 aminopeptidase
In DepthDetails ArticlePubMed
TargetAminopeptidase N(Sus scrofa (Pig))
University Of Lille 2
Curated by ChEMBL
LigandPNGBDBM50197497(2-benzyl-N-hydroxy-N'-(4-phenyl-butyl)-malonamide ...)
Affinity DataIC50: >1.00E+4nM. Assay description: Inhibition of pig kidney microsomal APN
In DepthDetails ArticlePubMed