BDBM50197501 2-(3-phenoxybenzyl)-N1-benzyl-N3-hydroxymalonamide::CHEMBL220364::N-benzyl-N'-hydroxy-2-(3-phenoxy-benzyl)-malonamide
SMILES ONC(=O)C(Cc1cccc(Oc2ccccc2)c1)C(=O)NCc1ccccc1
InChI Key InChIKey=ODBGQZOSULKBDH-UHFFFAOYSA-N
Data  3 IC50
  Tab Delimited (TSV)   2D SDfile   Computed 3D by Vconf -m prep SDfile
Find this compound or compounds like it in BindingDB:
Activity Spreadsheet -- Enzyme Inhibition Constant Data from BindingDB
Found 3 hits for monomerid = 50197501
TargetAminopeptidase N(Sus scrofa (Pig))
University Of Lille 2
Curated by ChEMBL
LigandPNGBDBM50197501(2-(3-phenoxybenzyl)-N1-benzyl-N3-hydroxymalonamide...)
Affinity DataIC50: >1.00E+4nM. Assay description: Inhibition of microsomal neural aminopeptidase in pig kidney
In DepthDetails ArticlePubMed
TargetM1 family aminopeptidase(Plasmodium falciparum (isolate FcB1 / Columbia))
University Of Lille
Curated by ChEMBL
LigandPNGBDBM50197501(2-(3-phenoxybenzyl)-N1-benzyl-N3-hydroxymalonamide...)
Affinity DataIC50:  164nM. Assay description: Inhibition of Plasmodium falciparum FcB1 M1 aminopeptidase
In DepthDetails ArticlePubMed
TargetAminopeptidase N(Sus scrofa (Pig))
University Of Lille 2
Curated by ChEMBL
LigandPNGBDBM50197501(2-(3-phenoxybenzyl)-N1-benzyl-N3-hydroxymalonamide...)
Affinity DataIC50: >1.00E+4nM. Assay description: Inhibition of pig kidney microsomal APN
In DepthDetails ArticlePubMed