BDBM50197522 CHEMBL3929492
SMILES Clc1ccc2[nH]c(=O)ccc2c1
InChI Key InChIKey=OJEBWFGRUPIVSD-UHFFFAOYSA-N
Data  1 KI  1 IC50
PDB links: 1 PDB ID matches this monomer.
  Tab Delimited (TSV)   2D SDfile   Computed 3D by Vconf -m prep SDfile
Find this compound or compounds like it in BindingDB:
Activity Spreadsheet -- Enzyme Inhibition Constant Data from BindingDB
Found 2 hits for monomerid = 50197522
TargetCoagulation factor XI(Homo sapiens (Human))
Astex Pharmaceuticals
Curated by ChEMBL
LigandPNGBDBM50197522(CHEMBL3929492)
Affinity DataKi:  7.00E+4nM. Assay description: Inhibition of human factor 11a using pyroGlu-Pro-Arg-pNA.HCl substrate
TargetCoagulation factor XI(Homo sapiens (Human))
Astex Pharmaceuticals
Curated by ChEMBL
LigandPNGBDBM50197522(CHEMBL3929492)
Affinity DataIC50:  1.40E+5nM. Assay description: Inhibition of human factor 11a assessed as reduction in para-nitroanilide releasee using pyroGlu-Pro-Arg-pNA.HCl substrate by by chromogenic assay