BDBM50198099 2-(3-methyl-benzyl)-1,3-dioxo-2,3-dihydro-1H-isoindole-5-carboxylic acid [3-(2-methyl-piperidin-1-yl)-propyl]-amide; hydrochloride::CHEMBL535187
SMILES CC1CCCCN1CCCNC(=O)c1ccc2C(=O)N(Cc3cccc(C)c3)C(=O)c2c1
InChI Key InChIKey=PECITESBLGQWFT-UHFFFAOYSA-N
Data  1 IC50
  Tab Delimited (TSV)   2D SDfile   Computed 3D by Vconf -m prep SDfile
Find this compound or compounds like it in BindingDB:
Activity Spreadsheet -- Enzyme Inhibition Constant Data from BindingDB
Found 1 hit for monomerid = 50198099
TargetVoltage-dependent T-type calcium channel subunit alpha-1G(Homo sapiens (Human))
Institute Of Science And Technology
Curated by ChEMBL
LigandPNGBDBM50198099(2-(3-methyl-benzyl)-1,3-dioxo-2,3-dihydro-1H-isoin...)
Affinity DataIC50:  1.84E+3nM. Assay description: Inhibition of T-type calcium channel Cav3.1 expressed in HEK293 cells co-expressing alpha1G subunit and Kir2.1 potassium channel by patch-clamp assay
In DepthDetails ArticlePubMed