BDBM50201799 CHEMBL238792
SMILES CC1(C)OC2=C(C1Nc1cccc(c1)[N+]([O-])=O)C(=O)C(=O)c1ccccc21
InChI Key InChIKey=WRTZJNORAQACHJ-UHFFFAOYSA-N
Data  2 IC50
  Tab Delimited (TSV)   2D SDfile   Computed 3D by Vconf -m prep SDfile
Find this compound or compounds like it in BindingDB:
Activity Spreadsheet -- Enzyme Inhibition Constant Data from BindingDB
Found 2 hits for monomerid = 50201799
TargetNAD(P)H dehydrogenase [quinone] 1(Homo sapiens (Human))
Federal University Of Minas Gerais
Curated by ChEMBL
LigandPNGBDBM50201799(CHEMBL238792)
Affinity DataIC50: >3.20E+3nM. Assay description: Activation of NQO1 in human A549 cells assessed as decrease in cell survival incubated for 2 hrs measured after 7 days in presence of NQO1 inhibitor ...
In DepthDetails ArticlePubMed
TargetNAD(P)H dehydrogenase [quinone] 1(Homo sapiens (Human))
Federal University Of Minas Gerais
Curated by ChEMBL
LigandPNGBDBM50201799(CHEMBL238792)
Affinity DataIC50:  2.60E+3nM. Assay description: Activation of NQO1 in human A549 cells assessed as decrease in cell survival incubated for 2 hrs measured after 7 days by Hoechst 33258 staining base...
In DepthDetails ArticlePubMed