BDBM50203487 CHEMBL3961289
SMILES CN(C)C(=O)c1ccc2n(nc(Sc3c(Cl)cccc3Cl)c2c1)-c1ccc(cc1)C(O)=O
InChI Key InChIKey=KEZFSQIBHDEVNP-UHFFFAOYSA-N
Data  2 IC50
  Tab Delimited (TSV)   2D SDfile   Computed 3D by Vconf -m prep SDfile
Find this compound or compounds like it in BindingDB:
Activity Spreadsheet -- Enzyme Inhibition Constant Data from BindingDB
Found 2 hits for monomerid = 50203487
TargetNuclear receptor ROR-gamma(Homo sapiens (Human))
Galderma R & D
Curated by ChEMBL
LigandPNGBDBM50203487(CHEMBL3961289)
Affinity DataIC50:  590nM. Assay description: Inverse agonist activity at GAL4 DBD-fused RORgammat LBD (unknown origin) expressed in HG5LN cells after 18 hrs by luciferase reporter gene assay
In DepthDetails ArticlePubMed
TargetRetinoic acid receptor gamma(Homo sapiens (Human))
Galderma R & D
Curated by ChEMBL
LigandPNGBDBM50203487(CHEMBL3961289)
Affinity DataIC50: >1.00E+4nM. Assay description: Inverse agonist activity at GAL4 DBD-fused RARgamma LBD (unknown origin) expressed in human HG5LN cells after 18 hrs by luciferase reporter gene assa...
In DepthDetails ArticlePubMed