BDBM50203493 CHEMBL3912204
SMILES CN(C)C(=O)c1ccc2n(nc(Oc3c(C)cccc3Cl)c2c1)-c1ccc(cc1)C(O)=O
InChI Key InChIKey=SLLXKTYZEFJLBH-UHFFFAOYSA-N
Data  4 IC50
  Tab Delimited (TSV)   2D SDfile   Computed 3D by Vconf -m prep SDfile
Find this compound or compounds like it in BindingDB:
Activity Spreadsheet -- Enzyme Inhibition Constant Data from BindingDB
Found 4 hits for monomerid = 50203493
TargetNuclear receptor ROR-gamma(Homo sapiens (Human))
Galderma R & D
Curated by ChEMBL
LigandPNGBDBM50203493(CHEMBL3912204)
Affinity DataIC50:  120nM. Assay description: Inverse agonist activity at GAL4 DBD-fused RORgammat LBD (unknown origin) expressed in HG5LN cells after 18 hrs by luciferase reporter gene assay
In DepthDetails ArticlePubMed
TargetNuclear receptor ROR-gamma(Homo sapiens (Human))
Galderma R & D
Curated by ChEMBL
LigandPNGBDBM50203493(CHEMBL3912204)
Affinity DataIC50:  150nM. Assay description: Inverse agonist activity at RORgamma in human CD4+ T cells assessed as inhibition of IL-17A release after 4 days by HTRF assay
In DepthDetails ArticlePubMed
TargetNuclear receptor ROR-alpha(Homo sapiens (Human))
Galderma R & D
Curated by ChEMBL
LigandPNGBDBM50203493(CHEMBL3912204)
Affinity DataIC50: >1.00E+4nM. Assay description: Inverse agonist activity at GAL4 DBD-fused RORalpha LBD (unknown origin) expressed in HG5LN cells after 18 hrs by luciferase reporter gene assay
In DepthDetails ArticlePubMed
TargetRetinoic acid receptor gamma(Homo sapiens (Human))
Galderma R & D
Curated by ChEMBL
LigandPNGBDBM50203493(CHEMBL3912204)
Affinity DataIC50: >1.00E+4nM. Assay description: Inverse agonist activity at GAL4 DBD-fused RARgamma LBD (unknown origin) expressed in human HG5LN cells after 18 hrs by luciferase reporter gene assa...
In DepthDetails ArticlePubMed