BDBM50204087 CHEMBL3920392
SMILES [#6]\[#6](-[#6])=[#6]/[#6]-c1cc(-[#8])cc(-[#16]-c2ccccc2-[#6](-[#8])=O)c1-[#8]
InChI Key InChIKey=YLBDHHKLJYSCEH-UHFFFAOYSA-N
Data  1 KI  1 IC50
  Tab Delimited (TSV)   2D SDfile   Computed 3D by Vconf -m prep SDfile
Find this compound or compounds like it in BindingDB:
Activity Spreadsheet -- Enzyme Inhibition Constant Data from BindingDB
Found 2 hits for monomerid = 50204087
TargetAcetylcholinesterase(Electrophorus electricus (Electric eel))
Istituto Di Chimica Biomolecolare (Icb)
Curated by ChEMBL
LigandPNGBDBM50204087(CHEMBL3920392)
Affinity DataKi:  0.221nM. Assay description: Inhibition of Electrophorus electricus AChE using acetylthiocholine iodide as substrate by Dixon plot analysis
In DepthDetails ArticlePubMed
TargetAcetylcholinesterase(Electrophorus electricus (Electric eel))
Istituto Di Chimica Biomolecolare (Icb)
Curated by ChEMBL
LigandPNGBDBM50204087(CHEMBL3920392)
Affinity DataIC50:  7.88E+3nM. Assay description: Inhibition of Electrophorus electricus AChE using acetylthiocholine iodide as substrate incubated for 15 mins followed by substrate addition by Ellma...
In DepthDetails ArticlePubMed