BDBM50206032 4-(4-((3S,5S)-5-(thiazolidine-3-carbonyl)pyrrolidin-3-yl)piperazin-1-yl)phthalonitrile::CHEMBL238515
SMILES O=C([C@@H]1C[C@@H](CN1)N1CCN(CC1)c1ccc(C#N)c(c1)C#N)N1CCSC1
InChI Key InChIKey=GFRWMDZJFFMKMI-OALUTQOASA-N
Data  2 IC50
  Tab Delimited (TSV)   2D SDfile   Computed 3D by Vconf -m prep SDfile
Find this compound or compounds like it in BindingDB:
Activity Spreadsheet -- Enzyme Inhibition Constant Data from BindingDB
Found 2 hits for monomerid = 50206032
TargetDipeptidyl peptidase 4(Rattus norvegicus (rat))
Mitsubishi Pharma
Curated by ChEMBL
LigandPNGBDBM50206032(4-(4-((3S,5S)-5-(thiazolidine-3-carbonyl)pyrrolidi...)
Affinity DataIC50:  1.80nM. Assay description: Inhibition of DPP4 in rat plasma by fluorescence assay
In DepthDetails ArticlePubMed
TargetDipeptidyl peptidase 4(Homo sapiens (Human))
Mitsubishi Pharma
Curated by ChEMBL
LigandPNGBDBM50206032(4-(4-((3S,5S)-5-(thiazolidine-3-carbonyl)pyrrolidi...)
Affinity DataIC50:  1.30nM. Assay description: Inhibition of DPP4 in human plasma by fluorescence assay
In DepthDetails ArticlePubMed