BDBM50206438 1-(2,4,6-trioxo-tetrahydropyrimidin-5(6H)-ylideneamino)-1,3,5-triazinane-2,4,6-trione::CHEMBL220162
SMILES O=C1NC(=O)C(=Nn2c(=O)[nH]c(=O)[nH]c2=O)C(=O)N1
InChI Key InChIKey=VYIAHNBXLZRCMS-UHFFFAOYSA-N
Data  2 IC50
  Tab Delimited (TSV)   2D SDfile   Computed 3D by Vconf -m prep SDfile
Find this compound or compounds like it in BindingDB:
Activity Spreadsheet -- Enzyme Inhibition Constant Data from BindingDB
Found 2 hits for monomerid = 50206438
TargetRmtA(Emericella nidulans)
Sapienza University Of Rome
Curated by ChEMBL
LigandPNGBDBM50206438(1-(2,4,6-trioxo-tetrahydropyrimidin-5(6H)-ylidenea...)
Affinity DataIC50: >1.64E+5nM. Assay description: Inhibition of Aspergillus nidulans recombinant GST-RmtA expressed in BL21 cells
In DepthDetails ArticlePubMed
TargetProtein arginine N-methyltransferase 1 [11-371](Homo sapiens (Human))
Sapienza University Of Rome
Curated by ChEMBL
LigandPNGBDBM50206438(1-(2,4,6-trioxo-tetrahydropyrimidin-5(6H)-ylidenea...)
Affinity DataIC50: >1.64E+5nM. Assay description: Inhibition of human recombinant GST-PRMT1 expressed in BL21 cells
In DepthDetails ArticlePubMed