BDBM50206561 2-benzyl-3-(4-benzyl-piperazin-1-yl)-N-hydroxy-3-oxo-propionamide::2-benzyl-3-(4-benzylpiperazin-1-yl)-N-hydroxy-3-oxopropanamide::CHEMBL220420
SMILES ONC(=O)C(Cc1ccccc1)C(=O)N1CCN(Cc2ccccc2)CC1
InChI Key InChIKey=OCJCXTOYNOEDCS-UHFFFAOYSA-N
Data  1 IC50
  Tab Delimited (TSV)   2D SDfile   Computed 3D by Vconf -m prep SDfile
Find this compound or compounds like it in BindingDB:
Activity Spreadsheet -- Enzyme Inhibition Constant Data from BindingDB
Found 1 hit for monomerid = 50206561
TargetM1 family aminopeptidase(Plasmodium falciparum (isolate FcB1 / Columbia))
University Of Lille
Curated by ChEMBL
LigandPNGBDBM50206561(2-benzyl-3-(4-benzyl-piperazin-1-yl)-N-hydroxy-3-o...)
Affinity DataIC50:  1.76E+3nM. Assay description: Inhibition of Plasmodium falciparum FcB1 M1 aminopeptidase
In DepthDetails ArticlePubMed