BDBM50208349 CHEMBL128096
SMILES Clc1ccc(cc1)C(=O)NC(\N=C(/NC#N)Nc1cccnc1)C(Cl)(Cl)Cl
InChI Key InChIKey=PCQPNLGLGNWDNM-UHFFFAOYSA-N
Data  1 EC50
  Tab Delimited (TSV)   2D SDfile   Computed 3D by Vconf -m prep SDfile
Find this compound or compounds like it in BindingDB:
Activity Spreadsheet -- Enzyme Inhibition Constant Data from BindingDB
Found 1 hit for monomerid = 50208349
LigandPNGBDBM50208349(CHEMBL128096)
Affinity DataEC50:  1.00E+3nM. Assay description: In vitro ATP-sensitive potassium channel (KATP) activity in cells expressing human KATP channels Kir6.2 and sulfonylurea receptor 2B
In DepthDetails ArticlePubMed