BDBM50210059 CHEMBL127612
SMILES CC(C)(C)C(N\C(Nc1cccnc1)=C\[N+]([O-])=O)NC(=O)c1ccc(Cl)cc1
InChI Key InChIKey=WOUKEIYSZSAXRR-FOWTUZBSSA-N
Data  1 EC50
  Tab Delimited (TSV)   2D SDfile   Computed 3D by Vconf -m prep SDfile
Find this compound or compounds like it in BindingDB:
Activity Spreadsheet -- Enzyme Inhibition Constant Data from BindingDB
Found 1 hit for monomerid = 50210059
LigandPNGBDBM50210059(CHEMBL127612)
Affinity DataEC50: <1.00E+5nM. Assay description: In vitro ATP-sensitive potassium channel (KATP) activity in cells expressing human KATP channels Kir6.2 and sulfonylurea receptor 2B
In DepthDetails ArticlePubMed