BDBM50213353 CHEMBL308295
SMILES [H][C@]1(Cc2ccc(O)c(O)c2)CCCN1CCCCCCN(CCC)CCc1ccc(O)c(O)c1
InChI Key InChIKey=NGGFFSQKRFAGBP-XMMPIXPASA-N
Data  4 KI
  Tab Delimited (TSV)   2D SDfile   Computed 3D by Vconf -m prep SDfile
Find this compound or compounds like it in BindingDB:
Activity Spreadsheet -- Enzyme Inhibition Constant Data from BindingDB
Found 4 hits for monomerid = 50213353
TargetD(2) dopamine receptor(Rattus norvegicus (rat))TBA
LigandPNGBDBM50213353(CHEMBL308295)
Affinity DataKi:  3.20nM. Assay description: Binding affinity against Dopamine receptor D2 in rat striatal membranes using [3H]spiperone
In DepthDetails
LigandPNGBDBM50213353(CHEMBL308295)
Affinity DataKi:  19nM. Assay description: Binding affinity against Dopamine receptor D1 in rat striatal membranes using [3H]SCH-23390
In DepthDetails
TargetAdenosine receptor A2b(Rattus norvegicus)TBA
LigandPNGBDBM50213353(CHEMBL308295)
Affinity DataKi:  302nM. Assay description: Compound was tested for its binding affinity against Alpha-2 adrenergic receptor
In DepthDetails
TargetAlpha-1A/Alpha-1B/Alpha-1D adrenergic receptor(Homo sapiens (Human))TBA
LigandPNGBDBM50213353(CHEMBL308295)
Affinity DataKi:  389nM. Assay description: Compound was tested for its binding affinity against Alpha-1 adrenergic receptor
In DepthDetails