BDBM50218519 6,7-dimethoxy-3-(4-{[(2-nitrobenzyl)methylamino]methyl}phenyl)-chromen-2-one::CHEMBL265416
SMILES COc1cc2cc(-c3ccc(CN(C)Cc4ccccc4[N+]([O-])=O)cc3)c(=O)oc2cc1OC
InChI Key InChIKey=YNJVJLWDZRPHHU-UHFFFAOYSA-N
Data  2 IC50
  Tab Delimited (TSV)   2D SDfile   Computed 3D by Vconf -m prep SDfile
Find this compound or compounds like it in BindingDB:
Activity Spreadsheet -- Enzyme Inhibition Constant Data from BindingDB
Found 2 hits for monomerid = 50218519
TargetAcetylcholinesterase(Homo sapiens (Human))
University Of Bologna
Curated by ChEMBL
LigandPNGBDBM50218519(6,7-dimethoxy-3-(4-{[(2-nitrobenzyl)methylamino]me...)
Affinity DataIC50:  987nM. Assay description: Inhibition of human recombinant AChE
In DepthDetails ArticlePubMed
TargetCholinesterase(Homo sapiens (Human))
University Of Bologna
Curated by ChEMBL
LigandPNGBDBM50218519(6,7-dimethoxy-3-(4-{[(2-nitrobenzyl)methylamino]me...)
Affinity DataIC50: >0nM. Assay description: Inhibition of human recombinant BChE
In DepthDetails ArticlePubMed