BDBM50218657 CHEMBL289173
SMILES CC(C)c1ccc(cc1)-c1nc2cc(ccc2[nH]1)C(N)=N
InChI Key InChIKey=TZYBTOFHAKWVST-UHFFFAOYSA-N
Data  1 IC50
  Tab Delimited (TSV)   2D SDfile   Computed 3D by Vconf -m prep SDfile
Find this compound or compounds like it in BindingDB:
Activity Spreadsheet -- Enzyme Inhibition Constant Data from BindingDB
Found 1 hit for monomerid = 50218657
TargetSporulation kinase A(Bacillus subtilis (strain 168))
The R. W. Johnson Pharmaceutical Research Institute
Curated by ChEMBL
LigandPNGBDBM50218657(CHEMBL289173)
Affinity DataIC50:  2.20E+5nM. Assay description: Inhibition of KinA/Sp0F system two component (TCS) from Bacillus subtilis.
In DepthDetails ArticlePubMed