BDBM50221331 CHEMBL430672
SMILES [H][C@@]1(O[C@H]([C@H](O)[C@@H]1OC)n1ccc(=O)[nH]c1=O)[C@@H](O[C@H]1OC(=C[C@H](O)[C@@H]1O)C(=O)NCCc1cccc(OC)c1)C(N)=O
InChI Key InChIKey=YXJQGBSKAQYCFQ-QNFDJTDDSA-N
Data  1 IC50
  Tab Delimited (TSV)   2D SDfile   Computed 3D by Vconf -m prep SDfile
Find this compound or compounds like it in BindingDB:
Activity Spreadsheet -- Enzyme Inhibition Constant Data from BindingDB
Found 1 hit for monomerid = 50221331
TargetPhospho-N-acetylmuramoyl-pentapeptide-transferase(Escherichia coli (strain K12))
Sankyo
Curated by ChEMBL
LigandPNGBDBM50221331(CHEMBL430672)
Affinity DataIC50:  32.1nM. Assay description: Inhibitory activity against translocase I
In DepthDetails ArticlePubMed