BDBM50225217 5-(chloromethyl)-2-(2,4-dichlorophenoxy)phenol::CHEMBL240805
SMILES Oc1cc(CCl)ccc1Oc1ccc(Cl)cc1Cl
InChI Key InChIKey=XVCALTYAVXDHNO-UHFFFAOYSA-N
Data  1 IC50  1 Kd
PDB links: 2 PDB IDs match this monomer.
  Tab Delimited (TSV)   2D SDfile   Computed 3D by Vconf -m prep SDfile
Find this compound or compounds like it in BindingDB:
Activity Spreadsheet -- Enzyme Inhibition Constant Data from BindingDB
Found 2 hits for monomerid = 50225217
TargetTransthyretin(Homo sapiens (Human))
Institute Of Sciences
Curated by ChEMBL
LigandPNGBDBM50225217(5-(chloromethyl)-2-(2,4-dichlorophenoxy)phenol | C...)
Affinity DataKd:  5.70nMpH: 4.4Assay Description:Binding affinity to transthyretin at pH 4.4
TargetTransthyretin(Homo sapiens (Human))
Institute Of Sciences
Curated by ChEMBL
LigandPNGBDBM50225217(5-(chloromethyl)-2-(2,4-dichlorophenoxy)phenol | C...)
Affinity DataIC50:  850nMpH: 4.4Assay Description:Inhibition of transthyretin fibril formation at pH 4.4