BDBM50225701 CHEBI:4638::Difenidol::Difenidol HCl::Diphenidol::SK&F-478::SK-478::Vontrol
SMILES OC(CCCN1CCCCC1)(c1ccccc1)c1ccccc1
InChI Key InChIKey=OGAKLTJNUQRZJU-UHFFFAOYSA-N
Data  1 IC50
  Tab Delimited (TSV)   2D SDfile   Computed 3D by Vconf -m prep SDfile
Find this compound or compounds like it in BindingDB:
Activity Spreadsheet -- Enzyme Inhibition Constant Data from BindingDB
Found 1 hit for monomerid = 50225701
TargetSodium channel protein type 1/2/3 subunit alpha(Homo sapiens (Human))
TBA
Curated by ChEMBL
LigandPNGBDBM50225701(CHEBI:4638 | Difenidol | Difenidol HCl | Diphenido...)
Affinity DataIC50:  3.40E+3nM. Assay description: Inhibition of binding of Batrachotoxinin [3H]BTX-B to high affinity sites on voltage dependent sodium channels in a vesicular preparation from guinea...
In DepthDetails ArticlePubMed