BDBM50226182 2-Chloro-Acetamide::CHEMBL346368
SMILES NC(=O)CCl
InChI Key InChIKey=VXIVSQZSERGHQP-UHFFFAOYSA-N
Data  1 KI
  Tab Delimited (TSV)   2D SDfile   Computed 3D by Vconf -m prep SDfile
Find this compound or compounds like it in BindingDB:
Activity Spreadsheet -- Enzyme Inhibition Constant Data from BindingDB
Found 1 hit for monomerid = 50226182
TargetAlcohol dehydrogenase S chain(Equus caballus)
TBA
Curated by ChEMBL
LigandPNGBDBM50226182(2-Chloro-Acetamide | CHEMBL346368)
Affinity DataKi:  7.59E+6nM. Assay description: Inhibitory activity against horse liver alcohol dehydrogenase (ADH)
In DepthDetails ArticlePubMed