BDBM50226208 2,2-Dichloro-Acetamide::CHEMBL156653
SMILES NC(=O)C(Cl)Cl
InChI Key InChIKey=WCGGWVOVFQNRRS-UHFFFAOYSA-N
Data  1 KI
  Tab Delimited (TSV)   2D SDfile   Computed 3D by Vconf -m prep SDfile
Find this compound or compounds like it in BindingDB:
Activity Spreadsheet -- Enzyme Inhibition Constant Data from BindingDB
Found 1 hit for monomerid = 50226208
TargetAlcohol dehydrogenase S chain(Equus caballus)
TBA
Curated by ChEMBL
LigandPNGBDBM50226208(2,2-Dichloro-Acetamide | CHEMBL156653)
Affinity DataKi:  6.46E+6nM. Assay description: Inhibitory activity against horse liver alcohol dehydrogenase (ADH)
In DepthDetails ArticlePubMed