BDBM50226478 CHEMBL27977
SMILES CCCCc1nc(Cl)c(CC(=O)OC)n1Cc1ccc(NC(=O)c2cc(I)ccc2NS(=O)(=O)C(F)(F)F)cc1
InChI Key InChIKey=VSYAUMRHEHGWQT-UHFFFAOYSA-N
Data  1 IC50
  Tab Delimited (TSV)   2D SDfile   Computed 3D by Vconf -m prep SDfile
Find this compound or compounds like it in BindingDB:
Activity Spreadsheet -- Enzyme Inhibition Constant Data from BindingDB
Found 1 hit for monomerid = 50226478
LigandPNGBDBM50226478(CHEMBL27977)
Affinity DataIC50:  3.40E+3nM. Assay description: Inhibitory concentration that gave 50 percent displacement of specific binding of [3H]AII (2 nM) to Angiotensin II receptor
In DepthDetails ArticlePubMed