BDBM50227653 CHEMBL299207
SMILES CN(C)CC(COc1ccccc1CCc1cccc(F)c1)OC(=O)CCC(O)=O
InChI Key InChIKey=RIFKFGAGOHHLNZ-UHFFFAOYSA-N
Data  1 KI  1 IC50
  Tab Delimited (TSV)   2D SDfile   Computed 3D by Vconf -m prep SDfile
Find this compound or compounds like it in BindingDB:
Activity Spreadsheet -- Enzyme Inhibition Constant Data from BindingDB
Found 2 hits for monomerid = 50227653
TargetSerotonin 2 (5-HT2) receptor(RAT)
Mitsubishi Kasei
Curated by ChEMBL
LigandPNGBDBM50227653(CHEMBL299207)
Affinity DataKi:  41nM. Assay description: Inhibition of 5-hydroxytryptamine 2 induced vasoconstriction of rat caudal artery.
In DepthDetails ArticlePubMed
TargetSerotonin 2 (5-HT2) receptor(RAT)
Mitsubishi Kasei
Curated by ChEMBL
LigandPNGBDBM50227653(CHEMBL299207)
Affinity DataIC50:  133nM. Assay description: Antagonistic activity against 5-hydroxytryptamine 2 receptor on rat frontal cortex membrane.
In DepthDetails ArticlePubMed