BDBM50233686 4-(2'-methyl-biphenyl-3-sulfonyl)-5-methylsulfanyl-thiophene-2-carboxamidine::CHEMBL413993
SMILES CSc1sc(cc1S(=O)(=O)c1cccc(c1)-c1ccccc1C)C(N)=N
InChI Key InChIKey=YMYGZSZLCBRHOE-UHFFFAOYSA-N
Data  1 KI
  Tab Delimited (TSV)   2D SDfile   Computed 3D by Vconf -m prep SDfile
Find this compound or compounds like it in BindingDB:
Activity Spreadsheet -- Enzyme Inhibition Constant Data from BindingDB
Found 1 hit for monomerid = 50233686
TargetComplement C1s subcomponent(Homo sapiens (Human))
Johnson & Johnson Pharmaceutical Research And Development
Curated by ChEMBL
LigandPNGBDBM50233686(4-(2'-methyl-biphenyl-3-sulfonyl)-5-methylsulfanyl...)
Affinity DataKi:  30nM. Assay description: Inhibition of Complement C1s subcomponent
In DepthDetails ArticlePubMed